Hi,

I tried to compile Dazuko for SLES10 SP2 or OES2 SP1 Kernel:
2.6.16.60-0.21.
Unfortunately the compiler terminates with errors:

..........................

In file included from /usr/src/dazuko-2.3.5/dazuko_linux26_lsm.c:23:
/usr/src/dazuko-2.3.5/dazuko_linux26_lsm.h:821: error: unknown field
Γsecid_to_secctxΓ specified in initia
lizer
/usr/src/dazuko-2.3.5/dazuko_linux26_lsm.h:821: warning: initialization from
incompatible pointer type
/usr/src/dazuko-2.3.5/dazuko_linux26_lsm.h:824: error: unknown field
Γrelease_secctxΓ specified in initial
izer
/usr/src/dazuko-2.3.5/dazuko_linux26_lsm.h:824: warning: initialization from
incompatible pointer type
/usr/src/dazuko-2.3.5/dazuko_linux26_lsm.c: In function
Γdazuko_security_secid_to_secctxΓ:
/usr/src/dazuko-2.3.5/dazuko_linux26_lsm.c:1263: error: Γstruct
security_operationsΓ has no member named Γ
secid_to_secctxΓ
/usr/src/dazuko-2.3.5/dazuko_linux26_lsm.c:1263: error: Γstruct
security_operationsΓ has no member named Γ
secid_to_secctxΓ
/usr/src/dazuko-2.3.5/dazuko_linux26_lsm.c:1263: error: Γstruct
security_operationsΓ has no member named Γ
secid_to_secctxΓ
/usr/src/dazuko-2.3.5/dazuko_linux26_lsm.c:1263: error: Γstruct
security_operationsΓ has no member named Γ
secid_to_secctxΓ
/usr/src/dazuko-2.3.5/dazuko_linux26_lsm.c: In function
Γdazuko_security_release_secctxΓ:
/usr/src/dazuko-2.3.5/dazuko_linux26_lsm.c:1272: error: Γstruct
security_operationsΓ has no member named Γ
release_secctxΓ
/usr/src/dazuko-2.3.5/dazuko_linux26_lsm.c:1272: error: Γstruct
security_operationsΓ has no member named Γ
release_secctxΓ
/usr/src/dazuko-2.3.5/dazuko_linux26_lsm.c:1272: error: Γstruct
security_operationsΓ has no member named Γ
release_secctxΓ
/usr/src/dazuko-2.3.5/dazuko_linux26_lsm.c:1272: error: Γstruct
security_operationsΓ has no member named Γ
release_secctxΓ
make[4]: *** [/usr/src/dazuko-2.3.5/dazuko_linux26_lsm.o] Error 1
make[3]: *** [_module_/usr/src/dazuko-2.3.5] Error 2
make[2]: *** [modules] Error 2
make[1]: *** [modules] Error 2
make[1]: Leaving directory `/usr/src/linux-2.6.16.60-0.21-obj/x86_64/xen'
make: *** [dummy_rule] Error 2

..........................

Any ideas how to fix it?

Walter